{"text_format":"1","workbook":"xlsx","n_sheets":12,"sheets":["Start","Result","Übersicht","LBT","ImportExport","userformdata","language","Preferences","Geräteträger","Tragschiene","Zubehör","Lichtband"],"not_rendered":{"charts":0,"images":3,"macros":1,"external_links":1,"defined_names":8,"comments":2,"pivot_tables":0},"unopened":[],"bounds":{"document_bytes":16777216,"sheet_cells":100000,"rows_first":2000,"rows_last":500,"rows_between":2000,"halvings":0,"cell_chars":16384,"cell_head_chars":4096},"cells_cut":0,"cells_raw":0,"read":"whole","date_system":"1900"}

{"sheet":"Start","index":0,"n_rows":27,"n_cols":4,"rows_kept":27,"cut":false,"hidden":false,"merged":[[2,3,4,8],[12,1,12,5],[14,1,24,6],[11,1,11,7]]}
[]
[]
[null,null,null,"Continuous line configurator"]
[]
[]
[]
[]
[]
[]
[]
{"$rows_left_out":18}
{"sheet":"Result","index":1,"n_rows":188,"n_cols":7,"rows_kept":188,"cut":false,"hidden":false,"merged":[[166,0,166,2],[74,0,74,2],[97,0,97,2],[120,0,120,2],[143,0,143,2],[3,5,8,6],[2,0,2,2],[68,0,68,1],[28,0,28,1],[3,1,3,4],[4,1,4,4],[5,1,5,4],[6,1,6,4],[7,1,7,4],[8,1,8,4],[38,0,38,1],[48,0,48,1],[58,0,58,1],[10,0,10,5]]}
[]
[]
["Project information"]
["Customer name:",null,null,null,null,"Wenn die Gesamtlänge kein Vielfaches von 1,5m ist, muss bauseits gekürzt oder verlängert werden. Bitte um Rücksprache mit Ridi.\r\n"]
["Editor:"]
["Project name:"]
["Project number:"]
["Date of creation:"]
["Notes:"]
[]
{"$rows_left_out":179}
{"sheet":"Übersicht","index":2,"n_rows":51,"n_cols":18,"rows_kept":51,"cut":false,"hidden":true,"merged":[[10,14,10,15],[10,16,10,17],[44,0,44,1],[10,6,10,7],[10,8,10,9],[10,10,10,11],[10,12,10,13],[38,0,38,1]]}
["Bezeichnung","Menge","Einheiten Träger 1","Einheiten Träger 2","Einheiten Träger 3","Einheiten Träger 4","Einheiten Blind","Einheiten Gesamt","Gesamtlänge","Systemleistung","Zeile",null,null,"Formel"]
["Lichtband 1",2,1,null,null,null,2,{"$f":"C2+D2+E2+F2+G2","v":3},{"$f":"(C2*$B$32/1000)+(D2*$C$32/1000)+(E2*$D$32/1000)+(F2*$E$32/1000)+(G2*1.5)","v":4},{"$f":"C2*$B$37+D2*C$37+E2*$D$37+F2*$E$37","v":57},{"$f":"IFERROR(MATCH(I2,Lichtband!$A$1:$A$632,1),3)","v":10},null,null,"Makro"]
["Lichtband 2",2,1,1,null,null,2,{"$f":"C3+D3+E3+F3+G3","v":4},{"$f":"(C3*$B$32/1000)+(D3*$C$32/1000)+(E3*$D$32/1000)+(F3*$E$32/1000)+(G3*1.5)","v":5},{"$f":"C3*$B$37+D3*C$37+E3*$D$37+F3*$E$37","v":114},{"$f":"IFERROR(MATCH(I3,Lichtband!$A$1:$A$632,1),3)","v":12},null,null,"fix"]
["Lichtband 3",0,null,null,null,null,null,{"$f":"C4+D4+E4+F4+G4","v":0},0,{"$f":"C4*$B$37+D4*C$37+E4*$D$37+F4*$E$37","v":0},{"$f":"IFERROR(MATCH(I4,Lichtband!$A$1:$A$632,1),3)","v":3}]
["Lichtband 4",0,null,null,null,null,null,{"$f":"C5+D5+E5+F5+G5","v":0},0,{"$f":"C5*$B$37+D5*C$37+E5*$D$37+F5*$E$37","v":0},{"$f":"IFERROR(MATCH(I5,Lichtband!$A$1:$A$632,1),3)","v":3}]
["Lichtband 5",0,null,null,null,null,null,{"$f":"C6+D6+E6+F6+G6","v":0},0,{"$f":"C6*$B$37+D6*C$37+E6*$D$37+F6*$E$37","v":0},{"$f":"IFERROR(MATCH(I6,Lichtband!$A$1:$A$632,1),3)","v":3}]
[]
[]
[]
[]
{"$rows_left_out":42}
{"sheet":"LBT","index":3,"n_rows":11,"n_cols":5,"rows_kept":11,"cut":false,"hidden":true,"merged":[]}
["{{A2}}:\nRIDI LINIA Schnellmontagelichtband {{B32}}mm {{H2}}längig, {{I2}} Meter lang in Farbe {{B30}} bestehend aus:\n{{G13}}X {{B13}} ENEC zertifizierter LED Geräteträger {{B36}} Lumen / Maße in mm ({{B32}}/67/64) LBH aus stranggepressten Aluminium, zur optimalen Wärmeabfuhr der LED,  {{B30}} pulverbeschichtet. Die Enden des Geräteträgers sind mit thermoplastischen Kunststoffdichtungen versehen. Der Geräteträger wird mittels Halteklammern aus Federstahl in die Tragschiene werkzeuglos montiert und ist dabei in der Längsrichtung variabel an einer beliebigen Stelle positionierbar.\nLichttechnik: Der Geräteträger ist {{B31}} mit {{B35}} Lumen bei einer Systemleistung von {{B37}} Watt Lichtfarbe {{B35}}\nElektrische Ausführung: {{B33}}, 220-240 Volt und 0/50-60 Hz, geeignet für Gleichspannungsbetrieb.\nDie elektrische Verbindung zwischen Geräteträger und Tragschiene erfolgt durch ein patentiertes Steckergehäuse, Verdrehschutzsicher mit automatischer Zwangserdung.  Die Phasenwahl ist am Steckergehäuse werkzeuglos einstellbar. Schutzklasse I.\nTragschiene {{B40}} mit Stromführungsprofil {{B41}} Verwindungssteiff, profilierte Tragschiene aus verzinktem, vorlackiertem {{B40}}en Stahlblech.\nMit durchgehender Stromführung zur freien Anordnung der Geräteträger als Band oder mit variablen Abständen. Verwechslungssichere Montage mit durchgehender farbiger Kennzeichnung.\nElektrische Ausführung:\nDie elektrische Verbindung zwischen zwei Tragschienen erfolgt mit einem Verbindungsadapter {{B21}}, die Netzeinspeisung über ein Einspeiseteil {{B24}}. Beide Teile haben eine automatische Zwangserdung. Befestigung durch {{B43}}\n\nDie angegebenen Stückzahlen bezieht sich auf {{B2}}x die oben angegebene Spezifikation.\n\n"]
[]
[]
[]
[]
[]
[]
[]
[]
[]
{"$rows_left_out":2}
{"sheet":"ImportExport","index":4,"n_rows":941,"n_cols":6,"rows_kept":941,"cut":false,"hidden":true,"merged":[]}
[]
["Art","Ridi-Nr","Bezeichnung","EGH Art.Nr ","EGH Preis","Lagerartikel"]
["Träger","1551021","VLGFP0501-5NDWS830B0250","7208567","69,10"]
["Träger","1551025","VLGFP1001-5NDWS830B0500","7208639","77,00"]
["Träger","1551029","VLGFP1501-5NDWS830B0750","7208813","96,90"]
["Träger","1551033","VLGFP1002-5NDWS830B0950","7208717","112,40"]
["Träger","1551036","VLGFP1502-5NDWS830B1400","7209008","131,60"]
["Träger","1551093","VLGFP1002-5NDWS830B1100","7208728","115,00"]
["Träger","1551094","VLGFP1502-5NDWS830B1700","7209018","143,30"]
["Träger","1551107","VLGFP1501-5NDWS830B0800-RF","7208824","104,90"]
{"$rows_left_out":932}
{"sheet":"userformdata","index":5,"n_rows":0,"n_cols":0,"rows_kept":0,"cut":false,"hidden":true,"merged":[]}

{"sheet":"language","index":6,"n_rows":238,"n_cols":9,"rows_kept":238,"cut":false,"hidden":true,"merged":[]}
["Type","Pref 1","Pref 2","Pref 3","German","English","French","Italian","Spanish"]
["Data","Data01",null,null,"IP20","IP20","IP20","IP20","IP20"]
["Data","Data02",null,null,"IP54","IP54","IP54","IP54","IP54"]
["Data","Data03",null,null,"Deckenbefestiger (VLTHD)","Hanger for ceiling mounting (VLTHD)","Fixation pour montage au plafond (VLTHD)","Gancio per montaggio a plafone (VLTHD)","Abrazadera para montaje en techo (VLTHD)"]
["Data","Data04",null,null,"Kettenaufhänger mit Einstellmutter (VLTHA)","Chain suspension hanger, adjustable nut (VLTHA)","Suspension par chaîne avec écrou moleté (VLTHA)","Gancio per sospensione a catena, dado regolabile (VLTHA)","Abrazadera para suspensión de cadena, tuerca ajustable (VLTHA)"]
["Data","Data05",null,null,"Kettenaufhänger mit Schnellverstellung (VLTHB)","Chain suspension hanger, quick adjustment (VLTHB) ","Suspension par chaîine avec clip à ressort (VLTHB)","Gancio per sospensione a catena, regolazione rapida (VLTHB) ","Abrazadera para suspensión de cadena, ajuste rápido (VLTHB)"]
["Data","Data06",null,null,"Seilaufhänger mit Deckenbefestiger (VLTHSD)","Hanger with wire + ceiling fixing (VLTHSD)","Filin de suspension avec fixation plafond (VLTHSD)","Gancio con filo + fissaggio a plafone (VLTHSD)","Abrazadera con cable + fijación a techo (VLTHSD)"]
["Data","Data07",null,null,"Seilaufhänger mit Ringöse (VLTHS)","Hanger with wire + ring loop (VLTHS)","Filin de suspension avec œillet (VLTHS)","Gancio con filo + anello (VLTHS)","Abrazadera con cable + presilla (VLTHS)"]
["Data","Data08",null,null,"Seilaufhänger mit Baldachin (VLTHSB)","Hanger with wire + canopy (VLTHSB)","Filin de suspension avec baldaquin (VLTHSB)","Gancio con filo + rosone (VLTHSB)","Abrazadera con cable + florón (VLTHSB)"]
["Data","Data09",null,null,"LED-Abdeckung extrem tief strahlend","LED cover extreme narrow beam","Optique LED super intensive","Cover led a fascio estremamente concentrante","Óptica de haz muy estrecho"]
{"$rows_left_out":229}
{"sheet":"Preferences","index":7,"n_rows":5,"n_cols":5,"rows_kept":5,"cut":false,"hidden":true,"merged":[]}
["lang Col",6,null,"langColLast",5]
["lang Row",2]
[]
[null,false]
[null,false]

{"sheet":"Geräteträger","index":8,"n_rows":862,"n_cols":21,"rows_kept":862,"cut":false,"hidden":true,"merged":[]}
["ArtNr","ArtBez","Kurztext","Lichtlenker","Bruttopreis","Bruttogewicht","B","D","H","L","Leuchtenleistung","Leuchtenlichtstrom","Lichtfarbe","Vorschaltgerät","Gehäusefarbe","Deeplink","EAN","EGH Art.Nr ","EGH Preis","Lager","Lichtbandart"]
["1551021","VLGFP0501-5NDWS830B0250","Geräteträger mit Griffrille weiß, HACCP zertifiziert, IP54, 5-polig, eine LED-Reihe 2500lm, LF 830, Prismen mit breiter Lichtverteilung, elektronische","LED cover wide beam",142.5,"1,018","67",null,"66","500","18","2600","830","LED driver","white","https://www.ridi.de/go/1551021","4029299506761",7208567,"69,10",null,"VLGFP  prisms"]
["1551025","VLGFP1001-5NDWS830B0500","Geräteträger mit Griffrille weiß, HACCP zertifiziert, IP54, 5-polig, eine LED-Reihe 5000lm, LF 830, Prismen mit breiter Lichtverteilung, elektronische","LED cover wide beam",157.9,"1,612","67",null,"66","1000","37","5200","830","LED driver","white","https://www.ridi.de/go/1551025","4029299506884",7208639,"77,00",null,"VLGFP  prisms"]
["1551029","VLGFP1501-5NDWS830B0750","Geräteträger mit Griffrille weiß, HACCP zertifiziert, IP54, 5-polig, eine LED-Reihe 7500lm, LF 840, Prismen mit breiter Lichtverteilung, elektronische","LED cover wide beam",198.9,"2,184","67",null,"66","1500","55","7700","830","LED driver","white","https://www.ridi.de/go/1551029","4029299507003",7208813,"96,90",null,"VLGFP  prisms"]
["1551033","VLGFP1002-5NDWS830B0950","Geräteträger mit Griffrille weiß, HACCP zertifiziert, IP54, 5-polig, zwei LED-Reihen 9500lm, LF 830, Prismen mit breiter Lichtverteilung, elektronisch","LED cover wide beam",230.6,"1,856","67",null,"66","1000","66","9400","830","LED driver","white","https://www.ridi.de/go/1551033","4029299507126",7208717,"112,40",null,"VLGFP  prisms"]
["1551036","VLGFP1502-5NDWS830B1400","Geräteträger mit Griffrille weiß, HACCP zertifiziert, IP54, 5-polig, zwei LED-Reihen 14000lm, LF 830, Prismen mit breiter Lichtverteilung, elektronisc","LED cover wide beam",270.10000000000002,"2,447","67",null,"66","1500","100","14100","830","LED driver","white","https://www.ridi.de/go/1551036","4029299507218",7209008,"131,60",null,"VLGFP  prisms"]
["1551093","VLGFP1002-5NDWS830B1100","Geräteträger mit Griffrille weiß, HACCP zertifiziert, IP54, 5-polig, zwei LED-Reihen 11000lm, LF 830, Prismen mit breiter Lichtverteilung, elektronisc","LED cover wide beam",236.1,"1,856","67",null,"66","1000","81","11100","830","LED driver","white","https://www.ridi.de/go/1551093","4029299508284",7208728,"115,00",null,"VLGFP  prisms"]
["1551094","VLGFP1502-5NDWS830B1700","Geräteträger mit Griffrille weiß, HACCP zertifiziert, IP54, 5-polig, zwei LED-Reihen 17000lm, LF 830, Prismen mit breiter Lichtverteilung, elektronisc","LED cover wide beam",294.39999999999998,"2,447","67",null,"66","1500","121","16700","830","LED driver","white","https://www.ridi.de/go/1551094","4029299508314",7209018,"143,30",null,"VLGFP  prisms"]
["1551107","VLGFP1501-5NDWS830B0800-RF","Geräteträger mit Griffrille weiß, IP54, 5-polig, eine LED-Reihe, Lichtstrom 10-stufig einstellbar max. 8000lm, LF 830, Prismen mit breiter Lichtvertei","LED cover wide beam",215.3,"2,184","67",null,"66","1500","55","7970","830","LED driver","white","https://www.ridi.de/go/1551107","4029299508543",7208824,"104,90",null,"VLGFP  prisms"]
["1551108","VLGFP1502-5NDWS830B1500-RF","Geräteträger mit Griffrille weiß, IP54, 5-polig, zwei LED-Reihen, Lichtstrom 10-stufig einstellbar max. 15000lm, LF 830, Prismen mit breiter Lichtvert","LED cover wide beam",283.89999999999998,"2,447","67",null,"66","1500","100","14900","830","LED driver","white","https://www.ridi.de/go/1551108","4029299508550",7209024,"138,40",null,"VLGFP  prisms"]
{"$rows_left_out":853}
{"sheet":"Tragschiene","index":9,"n_rows":37,"n_cols":20,"rows_kept":37,"cut":false,"hidden":true,"merged":[]}
["ArtNr","ArtBez","Kurztext","Merkmal","Bruttopreis","Bruttogeiwcht","B","D","H","L","Leuchtenleistung","Leuchtenlichtstrom","Lichtfarbe","Vorschaltgerät","Gehäusefarbe","Deeplink","EAN","EGH Art.Nr ","EGH Preis","Lager"]
["1500133","VLTM 1500-5","Tragschiene weiß, 5-polige Stromführung, L=1500mm","5x2,5mm²",31.5,"1,856","64",null,"50","1500",null,null,null,"ohne VG","white","https://www.ridi.de/go/1500133","4029299505856",7407772,"14,70"]
["1500137","VLTM 3000-5","Tragschiene weiß, 5-polige Stromführung, L=3000mm","5x2,5mm²",52.5,"3,691","64",null,"50","3000",null,null,null,"ohne VG","white","https://www.ridi.de/go/1500137","4029299505979",7407773,"24,50"]
["1500141","VLTM 4500-5","Tragschiene weiß, 5-polige Stromführung, L=4500mm","5x2,5mm²",72.8,"5,526","64",null,"50","4500",null,null,null,"ohne VG","white","https://www.ridi.de/go/1500141","4029299506099",7407775,"34,20"]
["1500133SI","VLTM 1500-5 SI","Tragschiene silbern, 5-polige Stromführung, L=1500mm","5x2,5mm²",32.4,"1,856","64",null,"50","1500",null,null,null,"ohne VG","silver","https://www.ridi.de/go/1500133SI","4029299505863",7209056,"15,70"]
["1500137SI","VLTM 3000-5 SI","Tragschiene silbern, 5-polige Stromführung, L=3000mm","5x2,5mm²",54.1,"3,691","64",null,"50","3000",null,null,null,"ohne VG","silver","https://www.ridi.de/go/1500137SI","4029299505986",7209066,"26,10"]
["1500141SI","VLTM 4500-5 SI","Tragschiene silbern, 5-polige Stromführung, L=4500mm","5x2,5mm²",75,"5,526","64",null,"50","4500",null,null,null,"ohne VG","silver","https://www.ridi.de/go/1500141SI","4029299506105",7209076,"35,20"]
["1500133SW","VLTM 1500-5 SW","Tragschiene schwarz, 5-polige Stromführung, L=1500mm","5x2,5mm²",32.4,"1,856","64",null,"50","1500",null,null,null,"ohne VG","black","https://www.ridi.de/go/1500133SW","4029299505870",7209057,"15,70"]
["1500137SW","VLTM 3000-5 SW","Tragschiene schwarz, 5-polige Stromführung, L=3000mm","5x2,5mm²",54.1,"3,691","64",null,"50","3000",null,null,null,"ohne VG","black","https://www.ridi.de/go/1500137SW","4029299505993",7209067,"26,10"]
["1500141SW","VLTM 4500-5 SW","Tragschiene schwarz, 5-polige Stromführung, L=4500mm","5x2,5mm²",75,"5,526","64",null,"50","4500",null,null,null,"ohne VG","black","https://www.ridi.de/go/1500141SW","4029299506112",7209077,"36,00"]
{"$rows_left_out":28}
{"sheet":"Zubehör","index":10,"n_rows":42,"n_cols":12,"rows_kept":42,"cut":false,"hidden":true,"merged":[]}
["Kategorie","Ar.Nr. ","Bezeichnung","Ridi Preis","EGH Art.Nr ","EGH Preis","Durchgangsverdrahtung","Farbe","IP","Aufhängung","Deeplink","Protected"]
["Verbinder",1207044,"VLTV-5",10.5,1539582,"4,80","5x2,5mm²",null,null,null,"https://www.ridi.de/go/1207044"]
["Verbinder",1207045,"VLTV-7",11.1,1539583,"5,00","5x2,5mm² & 2x1,5mm²",null,null,null,"https://www.ridi.de/go/1207045"]
["Verbinder",1207046,"VLTV-11",13,2104668,"6,10","5x2,5mm² & 6x1,5mm²",null,null,null,"https://www.ridi.de/go/1207046"]
["Verbinder",1207062,"VLTV-11/2,5",22,2011016,"10,70","5x2,5mm² & 6x2,5mm²",null,null,null,"https://www.ridi.de/go/1207062"]
["Enddeckel","0205791","VLTE",1.1000000000000001,1518249,"0,50",null,"white",null,null,"https://www.ridi.de/go/0205791"]
["Enddeckel","0205791SI","VLTE-Si",3.5,1518786,"1,20",null,"silver",null,null,"https://www.ridi.de/go/0205791SI"]
["Enddeckel","0205791SW","VLTE-SW",2.1,2010838,"0,80",null,"black",null,null,"https://www.ridi.de/go/0205791SW"]
["Einspeiser",1207041,"VLNE -5S",4.8,1539580,"2,20","5x2,5mm²","white",null,null,"https://www.ridi.de/go/1207041"]
["Einspeiser","1207041SW","VLNE -5S SW",4.9000000000000004,2010742,"2,30","5x2,5mm²","black",null,null,"https://www.ridi.de/go/1207041SW"]
{"$rows_left_out":33}
{"sheet":"Lichtband","index":11,"n_rows":632,"n_cols":14,"rows_kept":632,"cut":false,"hidden":true,"merged":[[0,2,0,4],[0,9,2,9]]}
[null,null,"Tragschienen",null,null,"Verbinder","Dichtung f. Verbinder","Endstücke","Einspeiser","Befestigung",null,"Geräteträger ","max"]
[null,"Bezeichnung","L1500","L3000","L4500",null,null,null,null,null,null,"L500","L1000","L1500"]
["Länge","Anz. Einh."]
[1,null,1,0,0,0,0,2,1,2]
[1.5,null,1,0,0,0,0,2,1,2]
[2,null,0,1,0,0,0,2,1,2]
[2.5,null,0,1,0,0,0,2,1,2]
[3,null,0,1,0,0,0,2,1,2]
[3.5,null,0,0,1,0,0,2,1,3]
[4,null,0,0,1,0,0,2,1,3]
{"$rows_left_out":622}